BDBM50232746 CHEMBL4063708::US11046670, Compound 32
SMILES [H][C@]12C[C@@]([H])(N(CC1)C(=O)OCc1ccccc1)c1cc(ccc21)N1CCN(C)CC1
InChI Key InChIKey=CQQWIHMDQBNBBE-AUSIDOKSSA-N
Data  4 KI
  Tab Delimited (TSV)   2D SDfile   Computed 3D by Vconf -m prep SDfile
Find this compound or compounds like it in BindingDB:
Activity Spreadsheet -- Enzyme Inhibition Constant Data from BindingDB
Found 2 hits for monomerid = 50232746
TargetSigma non-opioid intracellular receptor 1(Homo sapiens (Human))
Board of Regents, The University of Texas System
US Patent
LigandPNGBDBM50232746(CHEMBL4063708 | US11046670, Compound 32)
Affinity DataKi:  497nM. Assay description: Receptor binding assays were performed by the Psychoactive Drug Screening Program (PDSP) at Chapel Hill, N.C. The assay protocol book can be accessed...
In DepthDetails US Patent
TargetSigma non-opioid intracellular receptor 1(Cavia porcellus (Guinea pig))
The University Of Texas At Austin
Curated by ChEMBL
LigandPNGBDBM50232746(CHEMBL4063708 | US11046670, Compound 32)
Affinity DataKi:  841nM. Assay description: Displacement of [3H]-(+)-pentazocine from guinea pig brain sigma1 receptor by PDSP assay
In DepthDetails ArticlePubMed